0_0_17288176_32044.c:1:1: error: expected identifier or '(' before '/' token
//Su-Su-Sudoku
^
0_0_17288176_32044.c:2:3: error: too many decimal points in number
//2016.5.28
^
0_0_17288176_32044.c:5:1: error: missing terminating ' character
// As a result, the array 'r' 'c' 'm' weren't large enough for memorizing.
^
0_0_17288176_32044.c:6:20: fatal error: iostream: No such file or directory
#include <iostream>
^
compilation terminated.
|